{"text_format":"1","workbook":"xlsx","n_sheets":6,"sheets":["功能表","戶政表","重整表","新生表","編班繳交表","編班結果表"],"not_rendered":{"charts":0,"images":0,"macros":1,"external_links":0,"defined_names":0,"comments":4,"pivot_tables":0},"unopened":[],"bounds":{"document_bytes":16777216,"sheet_cells":100000,"rows_first":2000,"rows_last":500,"rows_between":2000,"halvings":0,"cell_chars":16384,"cell_head_chars":4096},"cells_cut":0,"cells_raw":0,"read":"whole","date_system":"1900"}

{"sheet":"功能表","index":0,"n_rows":30,"n_cols":11,"rows_kept":30,"cut":false,"hidden":false,"merged":[[19,3,19,15],[14,3,14,15],[15,3,15,15],[16,3,16,15],[17,3,17,15],[18,3,18,15]]}
[]
[]
[]
[]
[]
[]
[]
[]
[]
[]
[]
[]
[]
[null,"工作表說明："]
[null,null,"功能表：","VBA程式主要功能按鈕及流程。"]
{"$rows_left_out":16}
{"sheet":"戶政表","index":1,"n_rows":4,"n_cols":8,"rows_kept":4,"cut":false,"hidden":false,"merged":[[0,0,0,7],[1,0,2,0],[1,1,2,1],[1,2,2,2],[1,3,2,3],[1,4,2,4],[1,5,2,5],[1,6,2,6],[1,7,2,7],[3,7,4,7],[3,0,4,0],[3,1,4,1],[3,2,4,2],[3,3,4,5],[3,6,4,6]]}
["請從A6儲存格開始貼上，只需貼上學生戶籍資料。"]
["學","就學號碼","學　　童　　姓　　名","統 一 編 號","出生年月日","遷入年月日","原住民註記","異　　　　　　　動　　　　　　　記　　　　　　　事"]
[]
["號","性　　別","父　　　姓　　　名","母　　　姓　　　名",null,null,"稱　　　謂","戶　　　　　　　籍　　　　　　　地　　　　　　　址"]

{"sheet":"重整表","index":2,"n_rows":4,"n_cols":16,"rows_kept":4,"cut":false,"hidden":false,"merged":[]}
["學","就學號碼","學　　童　　姓　　名","統 一 編 號","出生年月日","遷入年月日","原住民註記","異　　　　　　　動　　　　　　　記　　　　　　　事","號","性　　別","父　　　姓　　　名","母　　　姓　　　名",null,null,"稱　　　謂","戶籍地址"]
["RLRP08410","學　齡　兒　童　名　冊",null,null,null,null,null,null,"戶政所別：","彰化縣彰化戶政事務所"]
["學區名稱：","彰化市民生國小",null,null,null,null,null,null,"學 年 度：","111年度"]
["學","就學號碼","學　　童　　姓　　名","統 一 編 號","出生年月日","遷入年月日","原住民註記","異　　 　　　　動　　　 　　　記　　 　　　　事","號","性　　別","父　　　姓　　　名","母　　　姓　　　名",null,null,"稱　　　謂","戶籍地址"]

{"sheet":"新生表","index":3,"n_rows":180,"n_cols":20,"rows_kept":180,"cut":false,"hidden":false,"merged":[]}
["學號","姓名","性別","入學年","班級","座號","生日(西元)","身份證字號","父親姓名","母親姓名","郵遞區號","電話","住址(不含縣市?鎮)","緊急聯方式","入學前國小名稱","戶籍遷入日期(西元)","學生行動電話","連絡地址","監護人","監護人行動電話"]
[null,{"$f":"IF(ISBLANK(重整表!#REF!),\"\",重整表!#REF!)","v":{"$error":"#REF!"}},{"$f":"IF(ISBLANK(重整表!#REF!),\"\",IF(重整表!#REF!=\"男\",1,IF(重整表!#REF!=\"女\",2)))","v":{"$error":"#REF!"}},null,{"$f":"IF(ISERROR(VLOOKUP($B2,IF({1,0},編班結果表!$E$4:$E$303,編班結果表!$B$4:$B$303),2,)),\"\",VLOOKUP($B2,IF({1,0},編班結果表!$E$4:$E$303,編班結果表!$B$4:$B$303),2,))","v":""},{"$f":"IF(ISERROR(VLOOKUP($B2,IF({1,0},編班結果表!$E$4:$F$303,編班結果表!$C$4:$C$303),2,FALSE)),\"\",VLOOKUP($B2,IF({1,0},編班結果表!$E$4:$F$303,編班結果表!$C$4:$C$303),2,FALSE))","v":""},{"$f":"IF(SEARCH(\"/\",重整表!#REF!)=3,LEFT(重整表!#REF!,2)+1911&MID(重整表!#REF!,3,8),LEFT(重整表!#REF!,3)+1911&MID(重整表!#REF!,4,8))","v":{"$error":"#REF!"}},{"$f":"IF(ISBLANK(重整表!#REF!),\"\",重整表!#REF!)","v":{"$error":"#REF!"}},{"$f":"IF(ISBLANK(重整表!#REF!),\"\",重整表!#REF!)","v":{"$error":"#REF!"}},{"$f":"IF(ISBLANK(重整表!#REF!),\"\",重整表!#REF!)","v":{"$error":"#REF!"}},null,null,{"$f":"IF(ISBLANK(重整表!#REF!),\"\",重整表!#REF!)","v":{"$error":"#REF!"}},null,null,{"$f":"IF(SEARCH(\"/\",重整表!#REF!)=3,LEFT(重整表!#REF!,2)+1911&MID(重整表!#REF!,3,8),LEFT(重整表!#REF!,3)+1911&MID(重整表!#REF!,4,8))","v":{"$error":"#REF!"}}]
[null,{"$f":"IF(ISBLANK(重整表!#REF!),\"\",重整表!#REF!)","v":{"$error":"#REF!"}},{"$f":"IF(ISBLANK(重整表!#REF!),\"\",IF(重整表!#REF!=\"男\",1,IF(重整表!#REF!=\"女\",2)))","v":{"$error":"#REF!"}},null,{"$f":"IF(ISERROR(VLOOKUP($B3,IF({1,0},編班結果表!$E$4:$E$303,編班結果表!$B$4:$B$303),2,)),\"\",VLOOKUP($B3,IF({1,0},編班結果表!$E$4:$E$303,編班結果表!$B$4:$B$303),2,))","v":""},{"$f":"IF(ISERROR(VLOOKUP($B3,IF({1,0},編班結果表!$E$4:$F$303,編班結果表!$C$4:$C$303),2,FALSE)),\"\",VLOOKUP($B3,IF({1,0},編班結果表!$E$4:$F$303,編班結果表!$C$4:$C$303),2,FALSE))","v":""},{"$f":"IF(SEARCH(\"/\",重整表!#REF!)=3,LEFT(重整表!#REF!,2)+1911&MID(重整表!#REF!,3,8),LEFT(重整表!#REF!,3)+1911&MID(重整表!#REF!,4,8))","v":{"$error":"#REF!"}},{"$f":"IF(ISBLANK(重整表!#REF!),\"\",重整表!#REF!)","v":{"$error":"#REF!"}},{"$f":"IF(ISBLANK(重整表!#REF!),\"\",重整表!#REF!)","v":{"$error":"#REF!"}},{"$f":"IF(ISBLANK(重整表!#REF!),\"\",重整表!#REF!)","v":{"$error":"#REF!"}},null,null,{"$f":"IF(ISBLANK(重整表!#REF!),\"\",重整表!#REF!)","v":{"$error":"#REF!"}},null,null,{"$f":"IF(SEARCH(\"/\",重整表!#REF!)=3,LEFT(重整表!#REF!,2)+1911&MID(重整表!#REF!,3,8),LEFT(重整表!#REF!,3)+1911&MID(重整表!#REF!,4,8))","v":{"$error":"#REF!"}}]
[null,{"$f":"IF(ISBLANK(重整表!#REF!),\"\",重整表!#REF!)","v":{"$error":"#REF!"}},{"$f":"IF(ISBLANK(重整表!#REF!),\"\",IF(重整表!#REF!=\"男\",1,IF(重整表!#REF!=\"女\",2)))","v":{"$error":"#REF!"}},null,{"$f":"IF(ISERROR(VLOOKUP($B4,IF({1,0},編班結果表!$E$4:$E$303,編班結果表!$B$4:$B$303),2,)),\"\",VLOOKUP($B4,IF({1,0},編班結果表!$E$4:$E$303,編班結果表!$B$4:$B$303),2,))","v":""},{"$f":"IF(ISERROR(VLOOKUP($B4,IF({1,0},編班結果表!$E$4:$F$303,編班結果表!$C$4:$C$303),2,FALSE)),\"\",VLOOKUP($B4,IF({1,0},編班結果表!$E$4:$F$303,編班結果表!$C$4:$C$303),2,FALSE))","v":""},{"$f":"IF(SEARCH(\"/\",重整表!#REF!)=3,LEFT(重整表!#REF!,2)+1911&MID(重整表!#REF!,3,8),LEFT(重整表!#REF!,3)+1911&MID(重整表!#REF!,4,8))","v":{"$error":"#REF!"}},{"$f":"IF(ISBLANK(重整表!#REF!),\"\",重整表!#REF!)","v":{"$error":"#REF!"}},{"$f":"IF(ISBLANK(重整表!#REF!),\"\",重整表!#REF!)","v":{"$error":"#REF!"}},{"$f":"IF(ISBLANK(重整表!#REF!),\"\",重整表!#REF!)","v":{"$error":"#REF!"}},null,null,{"$f":"IF(ISBLANK(重整表!#REF!),\"\",重整表!#REF!)","v":{"$error":"#REF!"}},null,null,{"$f":"IF(SEARCH(\"/\",重整表!#REF!)=3,LEFT(重整表!#REF!,2)+1911&MID(重整表!#REF!,3,8),LEFT(重整表!#REF!,3)+1911&MID(重整表!#REF!,4,8))","v":{"$error":"#REF!"}}]
[null,{"$f":"IF(ISBLANK(重整表!#REF!),\"\",重整表!#REF!)","v":{"$error":"#REF!"}},{"$f":"IF(ISBLANK(重整表!#REF!),\"\",IF(重整表!#REF!=\"男\",1,IF(重整表!#REF!=\"女\",2)))","v":{"$error":"#REF!"}},null,{"$f":"IF(ISERROR(VLOOKUP($B5,IF({1,0},編班結果表!$E$4:$E$303,編班結果表!$B$4:$B$303),2,)),\"\",VLOOKUP($B5,IF({1,0},編班結果表!$E$4:$E$303,編班結果表!$B$4:$B$303),2,))","v":""},{"$f":"IF(ISERROR(VLOOKUP($B5,IF({1,0},編班結果表!$E$4:$F$303,編班結果表!$C$4:$C$303),2,FALSE)),\"\",VLOOKUP($B5,IF({1,0},編班結果表!$E$4:$F$303,編班結果表!$C$4:$C$303),2,FALSE))","v":""},{"$f":"IF(SEARCH(\"/\",重整表!#REF!)=3,LEFT(重整表!#REF!,2)+1911&MID(重整表!#REF!,3,8),LEFT(重整表!#REF!,3)+1911&MID(重整表!#REF!,4,8))","v":{"$error":"#REF!"}},{"$f":"IF(ISBLANK(重整表!#REF!),\"\",重整表!#REF!)","v":{"$error":"#REF!"}},{"$f":"IF(ISBLANK(重整表!#REF!),\"\",重整表!#REF!)","v":{"$error":"#REF!"}},{"$f":"IF(ISBLANK(重整表!#REF!),\"\",重整表!#REF!)","v":{"$error":"#REF!"}},null,null,{"$f":"IF(ISBLANK(重整表!#REF!),\"\",重整表!#REF!)","v":{"$error":"#REF!"}},null,null,{"$f":"IF(SEARCH(\"/\",重整表!#REF!)=3,LEFT(重整表!#REF!,2)+1911&MID(重整表!#REF!,3,8),LEFT(重整表!#REF!,3)+1911&MID(重整表!#REF!,4,8))","v":{"$error":"#REF!"}}]
[null,{"$f":"IF(ISBLANK(重整表!#REF!),\"\",重整表!#REF!)","v":{"$error":"#REF!"}},{"$f":"IF(ISBLANK(重整表!#REF!),\"\",IF(重整表!#REF!=\"男\",1,IF(重整表!#REF!=\"女\",2)))","v":{"$error":"#REF!"}},null,{"$f":"IF(ISERROR(VLOOKUP($B6,IF({1,0},編班結果表!$E$4:$E$303,編班結果表!$B$4:$B$303),2,)),\"\",VLOOKUP($B6,IF({1,0},編班結果表!$E$4:$E$303,編班結果表!$B$4:$B$303),2,))","v":""},{"$f":"IF(ISERROR(VLOOKUP($B6,IF({1,0},編班結果表!$E$4:$F$303,編班結果表!$C$4:$C$303),2,FALSE)),\"\",VLOOKUP($B6,IF({1,0},編班結果表!$E$4:$F$303,編班結果表!$C$4:$C$303),2,FALSE))","v":""},{"$f":"IF(SEARCH(\"/\",重整表!#REF!)=3,LEFT(重整表!#REF!,2)+1911&MID(重整表!#REF!,3,8),LEFT(重整表!#REF!,3)+1911&MID(重整表!#REF!,4,8))","v":{"$error":"#REF!"}},{"$f":"IF(ISBLANK(重整表!#REF!),\"\",重整表!#REF!)","v":{"$error":"#REF!"}},{"$f":"IF(ISBLANK(重整表!#REF!),\"\",重整表!#REF!)","v":{"$error":"#REF!"}},{"$f":"IF(ISBLANK(重整表!#REF!),\"\",重整表!#REF!)","v":{"$error":"#REF!"}},null,null,{"$f":"IF(ISBLANK(重整表!#REF!),\"\",重整表!#REF!)","v":{"$error":"#REF!"}},null,null,{"$f":"IF(SEARCH(\"/\",重整表!#REF!)=3,LEFT(重整表!#REF!,2)+1911&MID(重整表!#REF!,3,8),LEFT(重整表!#REF!,3)+1911&MID(重整表!#REF!,4,8))","v":{"$error":"#REF!"}}]
[null,{"$f":"IF(ISBLANK(重整表!#REF!),\"\",重整表!#REF!)","v":{"$error":"#REF!"}},{"$f":"IF(ISBLANK(重整表!#REF!),\"\",IF(重整表!#REF!=\"男\",1,IF(重整表!#REF!=\"女\",2)))","v":{"$error":"#REF!"}},null,{"$f":"IF(ISERROR(VLOOKUP($B7,IF({1,0},編班結果表!$E$4:$E$303,編班結果表!$B$4:$B$303),2,)),\"\",VLOOKUP($B7,IF({1,0},編班結果表!$E$4:$E$303,編班結果表!$B$4:$B$303),2,))","v":""},{"$f":"IF(ISERROR(VLOOKUP($B7,IF({1,0},編班結果表!$E$4:$F$303,編班結果表!$C$4:$C$303),2,FALSE)),\"\",VLOOKUP($B7,IF({1,0},編班結果表!$E$4:$F$303,編班結果表!$C$4:$C$303),2,FALSE))","v":""},{"$f":"IF(SEARCH(\"/\",重整表!#REF!)=3,LEFT(重整表!#REF!,2)+1911&MID(重整表!#REF!,3,8),LEFT(重整表!#REF!,3)+1911&MID(重整表!#REF!,4,8))","v":{"$error":"#REF!"}},{"$f":"IF(ISBLANK(重整表!#REF!),\"\",重整表!#REF!)","v":{"$error":"#REF!"}},{"$f":"IF(ISBLANK(重整表!#REF!),\"\",重整表!#REF!)","v":{"$error":"#REF!"}},{"$f":"IF(ISBLANK(重整表!#REF!),\"\",重整表!#REF!)","v":{"$error":"#REF!"}},null,null,{"$f":"IF(ISBLANK(重整表!#REF!),\"\",重整表!#REF!)","v":{"$error":"#REF!"}},null,null,{"$f":"IF(SEARCH(\"/\",重整表!#REF!)=3,LEFT(重整表!#REF!,2)+1911&MID(重整表!#REF!,3,8),LEFT(重整表!#REF!,3)+1911&MID(重整表!#REF!,4,8))","v":{"$error":"#REF!"}}]
[null,{"$f":"IF(ISBLANK(重整表!#REF!),\"\",重整表!#REF!)","v":{"$error":"#REF!"}},{"$f":"IF(ISBLANK(重整表!#REF!),\"\",IF(重整表!#REF!=\"男\",1,IF(重整表!#REF!=\"女\",2)))","v":{"$error":"#REF!"}},null,{"$f":"IF(ISERROR(VLOOKUP($B8,IF({1,0},編班結果表!$E$4:$E$303,編班結果表!$B$4:$B$303),2,)),\"\",VLOOKUP($B8,IF({1,0},編班結果表!$E$4:$E$303,編班結果表!$B$4:$B$303),2,))","v":""},{"$f":"IF(ISERROR(VLOOKUP($B8,IF({1,0},編班結果表!$E$4:$F$303,編班結果表!$C$4:$C$303),2,FALSE)),\"\",VLOOKUP($B8,IF({1,0},編班結果表!$E$4:$F$303,編班結果表!$C$4:$C$303),2,FALSE))","v":""},{"$f":"IF(SEARCH(\"/\",重整表!#REF!)=3,LEFT(重整表!#REF!,2)+1911&MID(重整表!#REF!,3,8),LEFT(重整表!#REF!,3)+1911&MID(重整表!#REF!,4,8))","v":{"$error":"#REF!"}},{"$f":"IF(ISBLANK(重整表!#REF!),\"\",重整表!#REF!)","v":{"$error":"#REF!"}},{"$f":"IF(ISBLANK(重整表!#REF!),\"\",重整表!#REF!)","v":{"$error":"#REF!"}},{"$f":"IF(ISBLANK(重整表!#REF!),\"\",重整表!#REF!)","v":{"$error":"#REF!"}},null,null,{"$f":"IF(ISBLANK(重整表!#REF!),\"\",重整表!#REF!)","v":{"$error":"#REF!"}},null,null,{"$f":"IF(SEARCH(\"/\",重整表!#REF!)=3,LEFT(重整表!#REF!,2)+1911&MID(重整表!#REF!,3,8),LEFT(重整表!#REF!,3)+1911&MID(重整表!#REF!,4,8))","v":{"$error":"#REF!"}}]
[null,{"$f":"IF(ISBLANK(重整表!#REF!),\"\",重整表!#REF!)","v":{"$error":"#REF!"}},{"$f":"IF(ISBLANK(重整表!#REF!),\"\",IF(重整表!#REF!=\"男\",1,IF(重整表!#REF!=\"女\",2)))","v":{"$error":"#REF!"}},null,{"$f":"IF(ISERROR(VLOOKUP($B9,IF({1,0},編班結果表!$E$4:$E$303,編班結果表!$B$4:$B$303),2,)),\"\",VLOOKUP($B9,IF({1,0},編班結果表!$E$4:$E$303,編班結果表!$B$4:$B$303),2,))","v":""},{"$f":"IF(ISERROR(VLOOKUP($B9,IF({1,0},編班結果表!$E$4:$F$303,編班結果表!$C$4:$C$303),2,FALSE)),\"\",VLOOKUP($B9,IF({1,0},編班結果表!$E$4:$F$303,編班結果表!$C$4:$C$303),2,FALSE))","v":""},{"$f":"IF(SEARCH(\"/\",重整表!#REF!)=3,LEFT(重整表!#REF!,2)+1911&MID(重整表!#REF!,3,8),LEFT(重整表!#REF!,3)+1911&MID(重整表!#REF!,4,8))","v":{"$error":"#REF!"}},{"$f":"IF(ISBLANK(重整表!#REF!),\"\",重整表!#REF!)","v":{"$error":"#REF!"}},{"$f":"IF(ISBLANK(重整表!#REF!),\"\",重整表!#REF!)","v":{"$error":"#REF!"}},{"$f":"IF(ISBLANK(重整表!#REF!),\"\",重整表!#REF!)","v":{"$error":"#REF!"}},null,null,{"$f":"IF(ISBLANK(重整表!#REF!),\"\",重整表!#REF!)","v":{"$error":"#REF!"}},null,null,{"$f":"IF(SEARCH(\"/\",重整表!#REF!)=3,LEFT(重整表!#REF!,2)+1911&MID(重整表!#REF!,3,8),LEFT(重整表!#REF!,3)+1911&MID(重整表!#REF!,4,8))","v":{"$error":"#REF!"}}]
[null,{"$f":"IF(ISBLANK(重整表!#REF!),\"\",重整表!#REF!)","v":{"$error":"#REF!"}},{"$f":"IF(ISBLANK(重整表!#REF!),\"\",IF(重整表!#REF!=\"男\",1,IF(重整表!#REF!=\"女\",2)))","v":{"$error":"#REF!"}},null,{"$f":"IF(ISERROR(VLOOKUP($B10,IF({1,0},編班結果表!$E$4:$E$303,編班結果表!$B$4:$B$303),2,)),\"\",VLOOKUP($B10,IF({1,0},編班結果表!$E$4:$E$303,編班結果表!$B$4:$B$303),2,))","v":""},{"$f":"IF(ISERROR(VLOOKUP($B10,IF({1,0},編班結果表!$E$4:$F$303,編班結果表!$C$4:$C$303),2,FALSE)),\"\",VLOOKUP($B10,IF({1,0},編班結果表!$E$4:$F$303,編班結果表!$C$4:$C$303),2,FALSE))","v":""},{"$f":"IF(SEARCH(\"/\",重整表!#REF!)=3,LEFT(重整表!#REF!,2)+1911&MID(重整表!#REF!,3,8),LEFT(重整表!#REF!,3)+1911&MID(重整表!#REF!,4,8))","v":{"$error":"#REF!"}},{"$f":"IF(ISBLANK(重整表!#REF!),\"\",重整表!#REF!)","v":{"$error":"#REF!"}},{"$f":"IF(ISBLANK(重整表!#REF!),\"\",重整表!#REF!)","v":{"$error":"#REF!"}},{"$f":"IF(ISBLANK(重整表!#REF!),\"\",重整表!#REF!)","v":{"$error":"#REF!"}},null,null,{"$f":"IF(ISBLANK(重整表!#REF!),\"\",重整表!#REF!)","v":{"$error":"#REF!"}},null,null,{"$f":"IF(SEARCH(\"/\",重整表!#REF!)=3,LEFT(重整表!#REF!,2)+1911&MID(重整表!#REF!,3,8),LEFT(重整表!#REF!,3)+1911&MID(重整表!#REF!,4,8))","v":{"$error":"#REF!"}}]
[null,{"$f":"IF(ISBLANK(重整表!#REF!),\"\",重整表!#REF!)","v":{"$error":"#REF!"}},{"$f":"IF(ISBLANK(重整表!#REF!),\"\",IF(重整表!#REF!=\"男\",1,IF(重整表!#REF!=\"女\",2)))","v":{"$error":"#REF!"}},null,{"$f":"IF(ISERROR(VLOOKUP($B11,IF({1,0},編班結果表!$E$4:$E$303,編班結果表!$B$4:$B$303),2,)),\"\",VLOOKUP($B11,IF({1,0},編班結果表!$E$4:$E$303,編班結果表!$B$4:$B$303),2,))","v":""},{"$f":"IF(ISERROR(VLOOKUP($B11,IF({1,0},編班結果表!$E$4:$F$303,編班結果表!$C$4:$C$303),2,FALSE)),\"\",VLOOKUP($B11,IF({1,0},編班結果表!$E$4:$F$303,編班結果表!$C$4:$C$303),2,FALSE))","v":""},{"$f":"IF(SEARCH(\"/\",重整表!#REF!)=3,LEFT(重整表!#REF!,2)+1911&MID(重整表!#REF!,3,8),LEFT(重整表!#REF!,3)+1911&MID(重整表!#REF!,4,8))","v":{"$error":"#REF!"}},{"$f":"IF(ISBLANK(重整表!#REF!),\"\",重整表!#REF!)","v":{"$error":"#REF!"}},{"$f":"IF(ISBLANK(重整表!#REF!),\"\",重整表!#REF!)","v":{"$error":"#REF!"}},{"$f":"IF(ISBLANK(重整表!#REF!),\"\",重整表!#REF!)","v":{"$error":"#REF!"}},null,null,{"$f":"IF(ISBLANK(重整表!#REF!),\"\",重整表!#REF!)","v":{"$error":"#REF!"}},null,null,{"$f":"IF(SEARCH(\"/\",重整表!#REF!)=3,LEFT(重整表!#REF!,2)+1911&MID(重整表!#REF!,3,8),LEFT(重整表!#REF!,3)+1911&MID(重整表!#REF!,4,8))","v":{"$error":"#REF!"}}]
[null,{"$f":"IF(ISBLANK(重整表!#REF!),\"\",重整表!#REF!)","v":{"$error":"#REF!"}},{"$f":"IF(ISBLANK(重整表!#REF!),\"\",IF(重整表!#REF!=\"男\",1,IF(重整表!#REF!=\"女\",2)))","v":{"$error":"#REF!"}},null,{"$f":"IF(ISERROR(VLOOKUP($B12,IF({1,0},編班結果表!$E$4:$E$303,編班結果表!$B$4:$B$303),2,)),\"\",VLOOKUP($B12,IF({1,0},編班結果表!$E$4:$E$303,編班結果表!$B$4:$B$303),2,))","v":""},{"$f":"IF(ISERROR(VLOOKUP($B12,IF({1,0},編班結果表!$E$4:$F$303,編班結果表!$C$4:$C$303),2,FALSE)),\"\",VLOOKUP($B12,IF({1,0},編班結果表!$E$4:$F$303,編班結果表!$C$4:$C$303),2,FALSE))","v":""},{"$f":"IF(SEARCH(\"/\",重整表!#REF!)=3,LEFT(重整表!#REF!,2)+1911&MID(重整表!#REF!,3,8),LEFT(重整表!#REF!,3)+1911&MID(重整表!#REF!,4,8))","v":{"$error":"#REF!"}},{"$f":"IF(ISBLANK(重整表!#REF!),\"\",重整表!#REF!)","v":{"$error":"#REF!"}},{"$f":"IF(ISBLANK(重整表!#REF!),\"\",重整表!#REF!)","v":{"$error":"#REF!"}},{"$f":"IF(ISBLANK(重整表!#REF!),\"\",重整表!#REF!)","v":{"$error":"#REF!"}},null,null,{"$f":"IF(ISBLANK(重整表!#REF!),\"\",重整表!#REF!)","v":{"$error":"#REF!"}},null,null,{"$f":"IF(SEARCH(\"/\",重整表!#REF!)=3,LEFT(重整表!#REF!,2)+1911&MID(重整表!#REF!,3,8),LEFT(重整表!#REF!,3)+1911&MID(重整表!#REF!,4,8))","v":{"$error":"#REF!"}}]
[null,{"$f":"IF(ISBLANK(重整表!#REF!),\"\",重整表!#REF!)","v":{"$error":"#REF!"}},{"$f":"IF(ISBLANK(重整表!#REF!),\"\",IF(重整表!#REF!=\"男\",1,IF(重整表!#REF!=\"女\",2)))","v":{"$error":"#REF!"}},null,{"$f":"IF(ISERROR(VLOOKUP($B13,IF({1,0},編班結果表!$E$4:$E$303,編班結果表!$B$4:$B$303),2,)),\"\",VLOOKUP($B13,IF({1,0},編班結果表!$E$4:$E$303,編班結果表!$B$4:$B$303),2,))","v":""},{"$f":"IF(ISERROR(VLOOKUP($B13,IF({1,0},編班結果表!$E$4:$F$303,編班結果表!$C$4:$C$303),2,FALSE)),\"\",VLOOKUP($B13,IF({1,0},編班結果表!$E$4:$F$303,編班結果表!$C$4:$C$303),2,FALSE))","v":""},{"$f":"IF(SEARCH(\"/\",重整表!#REF!)=3,LEFT(重整表!#REF!,2)+1911&MID(重整表!#REF!,3,8),LEFT(重整表!#REF!,3)+1911&MID(重整表!#REF!,4,8))","v":{"$error":"#REF!"}},{"$f":"IF(ISBLANK(重整表!#REF!),\"\",重整表!#REF!)","v":{"$error":"#REF!"}},{"$f":"IF(ISBLANK(重整表!#REF!),\"\",重整表!#REF!)","v":{"$error":"#REF!"}},{"$f":"IF(ISBLANK(重整表!#REF!),\"\",重整表!#REF!)","v":{"$error":"#REF!"}},null,null,{"$f":"IF(ISBLANK(重整表!#REF!),\"\",重整表!#REF!)","v":{"$error":"#REF!"}},null,null,{"$f":"IF(SEARCH(\"/\",重整表!#REF!)=3,LEFT(重整表!#REF!,2)+1911&MID(重整表!#REF!,3,8),LEFT(重整表!#REF!,3)+1911&MID(重整表!#REF!,4,8))","v":{"$error":"#REF!"}}]
[null,{"$f":"IF(ISBLANK(重整表!#REF!),\"\",重整表!#REF!)","v":{"$error":"#REF!"}},{"$f":"IF(ISBLANK(重整表!#REF!),\"\",IF(重整表!#REF!=\"男\",1,IF(重整表!#REF!=\"女\",2)))","v":{"$error":"#REF!"}},null,{"$f":"IF(ISERROR(VLOOKUP($B14,IF({1,0},編班結果表!$E$4:$E$303,編班結果表!$B$4:$B$303),2,)),\"\",VLOOKUP($B14,IF({1,0},編班結果表!$E$4:$E$303,編班結果表!$B$4:$B$303),2,))","v":""},{"$f":"IF(ISERROR(VLOOKUP($B14,IF({1,0},編班結果表!$E$4:$F$303,編班結果表!$C$4:$C$303),2,FALSE)),\"\",VLOOKUP($B14,IF({1,0},編班結果表!$E$4:$F$303,編班結果表!$C$4:$C$303),2,FALSE))","v":""},{"$f":"IF(SEARCH(\"/\",重整表!#REF!)=3,LEFT(重整表!#REF!,2)+1911&MID(重整表!#REF!,3,8),LEFT(重整表!#REF!,3)+1911&MID(重整表!#REF!,4,8))","v":{"$error":"#REF!"}},{"$f":"IF(ISBLANK(重整表!#REF!),\"\",重整表!#REF!)","v":{"$error":"#REF!"}},{"$f":"IF(ISBLANK(重整表!#REF!),\"\",重整表!#REF!)","v":{"$error":"#REF!"}},{"$f":"IF(ISBLANK(重整表!#REF!),\"\",重整表!#REF!)","v":{"$error":"#REF!"}},null,null,{"$f":"IF(ISBLANK(重整表!#REF!),\"\",重整表!#REF!)","v":{"$error":"#REF!"}},null,null,{"$f":"IF(SEARCH(\"/\",重整表!#REF!)=3,LEFT(重整表!#REF!,2)+1911&MID(重整表!#REF!,3,8),LEFT(重整表!#REF!,3)+1911&MID(重整表!#REF!,4,8))","v":{"$error":"#REF!"}}]
[null,{"$f":"IF(ISBLANK(重整表!#REF!),\"\",重整表!#REF!)","v":{"$error":"#REF!"}},{"$f":"IF(ISBLANK(重整表!#REF!),\"\",IF(重整表!#REF!=\"男\",1,IF(重整表!#REF!=\"女\",2)))","v":{"$error":"#REF!"}},null,{"$f":"IF(ISERROR(VLOOKUP($B15,IF({1,0},編班結果表!$E$4:$E$303,編班結果表!$B$4:$B$303),2,)),\"\",VLOOKUP($B15,IF({1,0},編班結果表!$E$4:$E$303,編班結果表!$B$4:$B$303),2,))","v":""},{"$f":"IF(ISERROR(VLOOKUP($B15,IF({1,0},編班結果表!$E$4:$F$303,編班結果表!$C$4:$C$303),2,FALSE)),\"\",VLOOKUP($B15,IF({1,0},編班結果表!$E$4:$F$303,編班結果表!$C$4:$C$303),2,FALSE))","v":""},{"$f":"IF(SEARCH(\"/\",重整表!#REF!)=3,LEFT(重整表!#REF!,2)+1911&MID(重整表!#REF!,3,8),LEFT(重整表!#REF!,3)+1911&MID(重整表!#REF!,4,8))","v":{"$error":"#REF!"}},{"$f":"IF(ISBLANK(重整表!#REF!),\"\",重整表!#REF!)","v":{"$error":"#REF!"}},{"$f":"IF(ISBLANK(重整表!#REF!),\"\",重整表!#REF!)","v":{"$error":"#REF!"}},{"$f":"IF(ISBLANK(重整表!#REF!),\"\",重整表!#REF!)","v":{"$error":"#REF!"}},null,null,{"$f":"IF(ISBLANK(重整表!#REF!),\"\",重整表!#REF!)","v":{"$error":"#REF!"}},null,null,{"$f":"IF(SEARCH(\"/\",重整表!#REF!)=3,LEFT(重整表!#REF!,2)+1911&MID(重整表!#REF!,3,8),LEFT(重整表!#REF!,3)+1911&MID(重整表!#REF!,4,8))","v":{"$error":"#REF!"}}]
{"$rows_left_out":166}
{"sheet":"編班繳交表","index":4,"n_rows":182,"n_cols":10,"rows_kept":182,"cut":false,"hidden":false,"merged":[]}
["校名","芬國國小","班級數",3,"總人數",179]
["周杰倫","張惠妹"]
["流水號","班級","座號","性別","姓名","身分証字號","原就讀學校","編班類別","相關流水號","備註"]
[null,null,null,{"$f":"IF(ISBLANK(重整表!#REF!),\"\",IF(重整表!#REF!=\"男\",1,IF(重整表!#REF!=\"女\",2)))","v":{"$error":"#REF!"}},{"$f":"IF(ISBLANK(重整表!#REF!),\"\",重整表!#REF!)","v":{"$error":"#REF!"}},{"$f":"IF(ISBLANK(重整表!#REF!),\"\",重整表!#REF!)","v":{"$error":"#REF!"}}]
[null,null,null,{"$f":"IF(ISBLANK(重整表!#REF!),\"\",IF(重整表!#REF!=\"男\",1,IF(重整表!#REF!=\"女\",2)))","v":{"$error":"#REF!"}},{"$f":"IF(ISBLANK(重整表!#REF!),\"\",重整表!#REF!)","v":{"$error":"#REF!"}},{"$f":"IF(ISBLANK(重整表!#REF!),\"\",重整表!#REF!)","v":{"$error":"#REF!"}}]
[null,null,null,{"$f":"IF(ISBLANK(重整表!#REF!),\"\",IF(重整表!#REF!=\"男\",1,IF(重整表!#REF!=\"女\",2)))","v":{"$error":"#REF!"}},{"$f":"IF(ISBLANK(重整表!#REF!),\"\",重整表!#REF!)","v":{"$error":"#REF!"}},{"$f":"IF(ISBLANK(重整表!#REF!),\"\",重整表!#REF!)","v":{"$error":"#REF!"}}]
[null,null,null,{"$f":"IF(ISBLANK(重整表!#REF!),\"\",IF(重整表!#REF!=\"男\",1,IF(重整表!#REF!=\"女\",2)))","v":{"$error":"#REF!"}},{"$f":"IF(ISBLANK(重整表!#REF!),\"\",重整表!#REF!)","v":{"$error":"#REF!"}},{"$f":"IF(ISBLANK(重整表!#REF!),\"\",重整表!#REF!)","v":{"$error":"#REF!"}}]
[null,null,null,{"$f":"IF(ISBLANK(重整表!#REF!),\"\",IF(重整表!#REF!=\"男\",1,IF(重整表!#REF!=\"女\",2)))","v":{"$error":"#REF!"}},{"$f":"IF(ISBLANK(重整表!#REF!),\"\",重整表!#REF!)","v":{"$error":"#REF!"}},{"$f":"IF(ISBLANK(重整表!#REF!),\"\",重整表!#REF!)","v":{"$error":"#REF!"}}]
[null,null,null,{"$f":"IF(ISBLANK(重整表!#REF!),\"\",IF(重整表!#REF!=\"男\",1,IF(重整表!#REF!=\"女\",2)))","v":{"$error":"#REF!"}},{"$f":"IF(ISBLANK(重整表!#REF!),\"\",重整表!#REF!)","v":{"$error":"#REF!"}},{"$f":"IF(ISBLANK(重整表!#REF!),\"\",重整表!#REF!)","v":{"$error":"#REF!"}}]
[null,null,null,{"$f":"IF(ISBLANK(重整表!#REF!),\"\",IF(重整表!#REF!=\"男\",1,IF(重整表!#REF!=\"女\",2)))","v":{"$error":"#REF!"}},{"$f":"IF(ISBLANK(重整表!#REF!),\"\",重整表!#REF!)","v":{"$error":"#REF!"}},{"$f":"IF(ISBLANK(重整表!#REF!),\"\",重整表!#REF!)","v":{"$error":"#REF!"}}]
[null,null,null,{"$f":"IF(ISBLANK(重整表!#REF!),\"\",IF(重整表!#REF!=\"男\",1,IF(重整表!#REF!=\"女\",2)))","v":{"$error":"#REF!"}},{"$f":"IF(ISBLANK(重整表!#REF!),\"\",重整表!#REF!)","v":{"$error":"#REF!"}},{"$f":"IF(ISBLANK(重整表!#REF!),\"\",重整表!#REF!)","v":{"$error":"#REF!"}}]
[null,null,null,{"$f":"IF(ISBLANK(重整表!#REF!),\"\",IF(重整表!#REF!=\"男\",1,IF(重整表!#REF!=\"女\",2)))","v":{"$error":"#REF!"}},{"$f":"IF(ISBLANK(重整表!#REF!),\"\",重整表!#REF!)","v":{"$error":"#REF!"}},{"$f":"IF(ISBLANK(重整表!#REF!),\"\",重整表!#REF!)","v":{"$error":"#REF!"}}]
[null,null,null,{"$f":"IF(ISBLANK(重整表!#REF!),\"\",IF(重整表!#REF!=\"男\",1,IF(重整表!#REF!=\"女\",2)))","v":{"$error":"#REF!"}},{"$f":"IF(ISBLANK(重整表!#REF!),\"\",重整表!#REF!)","v":{"$error":"#REF!"}},{"$f":"IF(ISBLANK(重整表!#REF!),\"\",重整表!#REF!)","v":{"$error":"#REF!"}}]
[null,null,null,{"$f":"IF(ISBLANK(重整表!#REF!),\"\",IF(重整表!#REF!=\"男\",1,IF(重整表!#REF!=\"女\",2)))","v":{"$error":"#REF!"}},{"$f":"IF(ISBLANK(重整表!#REF!),\"\",重整表!#REF!)","v":{"$error":"#REF!"}},{"$f":"IF(ISBLANK(重整表!#REF!),\"\",重整表!#REF!)","v":{"$error":"#REF!"}}]
[null,null,null,{"$f":"IF(ISBLANK(重整表!#REF!),\"\",IF(重整表!#REF!=\"男\",1,IF(重整表!#REF!=\"女\",2)))","v":{"$error":"#REF!"}},{"$f":"IF(ISBLANK(重整表!#REF!),\"\",重整表!#REF!)","v":{"$error":"#REF!"}},{"$f":"IF(ISBLANK(重整表!#REF!),\"\",重整表!#REF!)","v":{"$error":"#REF!"}}]
{"$rows_left_out":168}
{"sheet":"編班結果表","index":5,"n_rows":3,"n_cols":10,"rows_kept":3,"cut":false,"hidden":false,"merged":[]}
["校名","大成國小","班級數",null,"總人數"]
["周杰倫","張惠妹"]
["流水號","班級","座號","性別","姓名","身分証字號","原就讀學校","編班類別","相關流水號","備註"]